Build Failed while doing create_binding_skeleton.cmd

Hi All,

I wanted to build add my own binding as provided in the video :- https://www.youtube.com/watch?v=30nhm0yIcvA

But When gave something like this :-
create_binding_skeleton.cmd VstarCam1

I am getting below error:-1:
[INFO] Scanning for projects…
[INFO] [INFO] ------------------------------------------------------------------------
[INFO] Building Eclipse SmartHome Bindings 0.9.0-SNAPSHOT
[INFO] ------------------------------------------------------------------------
[INFO]
[INFO] >>> maven-archetype-plugin:3.0.1:generate (default-cli) > generate-sources @ pom >>> [INFO]
[INFO] — build-helper-maven-plugin:1.8:add-source (add-source) @ pom —
[INFO] Source directory: C:\Users\user\openhab2-master2\git\smarthome\extensions\binding\src\main\groovy added.
[INFO]
[INFO] <<< maven-archetype-plugin:3.0.1:generate (default-cli) < generate-sources @ pom <<<
[INFO]
[INFO]
[INFO] — maven-archetype-plugin:3.0.1:generate (default-cli) @ pom —
[INFO] Generating project in Batch mode
[WARNING] Archetype not found in any catalog. Falling back to central repository.
[WARNING] Add a repsoitory with id ‘archetype’ in your settings.xml if archetype’s repository is elsewhere. [WARNING] The POM for org.eclipse.smarthome.archetype:org.eclipse.smarthome.archetype.binding:jar:0.9.0-SNAPSHOT is missing, no dependency information available
[INFO] ------------------------------------------------------------------------
[INFO] BUILD FAILURE
[INFO] ------------------------------------------------------------------------
[INFO] Total time: 12.652 s
[INFO] Finished at: 2017-08-31T18:27:29+05:30
[INFO] Final Memory: 19M/128M
[INFO] ------------------------------------------------------------------------
[ERROR] Failed to execute goal org.apache.maven.plugins:maven-archetype-plugin:3.0.1:generate (default-cli) on project pom: The desired archetype does not exist (org.eclipse.smarthome.archetype:org.eclipse.smarthome.archetype.binding:0.9.0-SNAPSHOT) -> [Help 1]
[ERROR]
[ERROR] To see the full stack trace of the errors, re-run Maven with the -e switch. [ERROR] Re-run Maven using the -X switch to enable full debug logging.
[ERROR]
[ERROR] For more information about the errors and possible solutions, please read the following articles:
[ERROR] [Help 1] http://cwiki.apache.org/confluence/display/MAVEN/MojoFailureException [INFO] Scanning for projects…
[INFO]
[INFO] ------------------------------------------------------------------------
[INFO] Building Eclipse SmartHome Bindings 0.9.0-SNAPSHOT [INFO] ------------------------------------------------------------------------ [INFO]
[INFO] >>> maven-archetype-plugin:3.0.1:generate (default-cli) > generate-sources @ pom >>>
[INFO] [INFO] — build-helper-maven-plugin:1.8:add-source (add-source) @ pom —
[INFO] Source directory: C:\Users\user\openhab2-master2\git\smarthome\extensions\binding\src\main\groovy added.
[INFO] [INFO] <<< maven-archetype-plugin:3.0.1:generate (default-cli) < generate-sources @ pom <<< [INFO]
[INFO] [INFO] — maven-archetype-plugin:3.0.1:generate (default-cli) @ pom —
[INFO] Generating project in Batch mode [WARNING] Archetype not found in any catalog. Falling back to central repository. [WARNING] Add a repsoitory with id ‘archetype’ in your settings.xml if archetype’s repository is elsewhere. [WARNING] The POM for org.eclipse.smarthome.archetype:org.eclipse.smarthome.archetype.binding.test:jar:0.9.0-SNAPSHOT is missing, no dependency information available
[INFO] ------------------------------------------------------------------------
[INFO] BUILD FAILURE [INFO] ------------------------------------------------------------------------ [INFO] Total time: 11.128 s
[INFO] Finished at: 2017-08-31T18:27:42+05:30 [INFO] Final Memory: 24M/182M
[INFO] ------------------------------------------------------------------------
[ERROR] Failed to execute goal org.apache.maven.plugins:maven-archetype-plugin:3.0.1:generate (default-cli) on project pom: The desired archetype does not exist (org.eclipse.smarthome.archetype:org.eclipse.smarthome.archetype.binding.test:0.9.0-SNAPSHOT) -> [Help 1]
[ERROR] [ERROR] To see the full stack trace of the errors, re-run Maven with the -e switch. [ERROR] Re-run Maven using the -X switch to enable full debug logging.
[ERROR] [ERROR] For more information about the errors and possible solutions, please read the following articles: [ERROR] [Help 1] http://cwiki.apache.org/confluence/display/MAVEN/MojoFailureException
C:\Users\user\openhab2-master2\git\smarthome\extensions\binding>

Please help , what could have been the problem.

BR,
Ravi